Click here to register.

Dialog Managers

Nested
instalation problem sphinx3-0.7 in linux server version 14.04 lts
User: mythili
Date: 12/23/2014 1:57 am
Views: 1205
Rating: 0

/usr/include/x86_64-linux-gnu/bits/stdio2.h:282:1: note: expected 'void * __restrict__' but argument is of type 'bitvec_t'
 fread (void *__restrict __ptr, size_t __size, size_t __n,
 ^
gs.c: In function 'gs_display':
gs.c:116:5: warning: implicit declaration of function 'bitvec_uint32size' [-Wimplicit-function-declaration]
     gs->n_mbyte = bitvec_uint32size(gs->n_density) * sizeof(uint32);
     ^
gs.c:120:8: warning: assignment makes integer from pointer without a cast [enabled by default]
     bv = bitvec_alloc(gs->n_density);
        ^
In file included from /usr/local/include/sphinxbase/libutil.h:91:0,
                 from ../../../include/s3types.h:84,
                 from ../../../include/gs.h:84,
                 from gs.c:60:
gs.c:137:25: error: subscripted value is neither array nor pointer nor vector
                     if (bitvec_is_set(bv, i)) {
                         ^
gs.c: In function 'gs_read':
gs.c:187:8: warning: assignment makes integer from pointer without a cast [enabled by default]
     bv = bitvec_alloc(gs->n_density);
        ^
gs.c:210:52: error: invalid type argument of unary '*' (have 'bitvec_t')
                 gs->codemap[m_id][s_id][code_id] = *bv;
                                                    ^
gs.c: In function 'gc_compute_closest_cw':
gs.c:224:13: warning: variable 'min_density' set but not used [-Wunused-but-set-variable]
     float64 min_density;
             ^
make[3]: *** [gs.lo] Error 1
make[3]: Leaving directory `/home/supervisor/sphinx3-0.7/src/libs3decoder/libam'

--- (Edited on 12/23/2014 1:57 am [GMT-0600] by Visitor) ---

PreviousNext